Skip to content
Started by user Brokkonaut
Running as SYSTEM
Building in workspace /home/tomcat/.jenkins/workspace/CubesideNMSUtils
The recommended git tool is: NONE
using credential a740e5fc-56b2-4305-b679-a29aeacfeabf
 > git rev-parse --resolve-git-dir /home/tomcat/.jenkins/workspace/CubesideNMSUtils/.git # timeout=10
Fetching changes from the remote Git repository
 > git config remote.origin.url https://github.com/Cubeside/CubesideNMSUtils.git # timeout=10
Fetching upstream changes from https://github.com/Cubeside/CubesideNMSUtils.git
 > git --version # timeout=10
 > git --version # 'git version 2.47.3'
using GIT_ASKPASS to set credentials 
 > git fetch --tags --force --progress -- https://github.com/Cubeside/CubesideNMSUtils.git +refs/heads/*:refs/remotes/origin/* # timeout=10
 > git rev-parse refs/remotes/origin/master^{commit} # timeout=10
Checking out Revision 5aafffc2c7fd14312a129116ec5fa486e06b5bbd (refs/remotes/origin/master)
 > git config core.sparsecheckout # timeout=10
 > git checkout -f 5aafffc2c7fd14312a129116ec5fa486e06b5bbd # timeout=10
Commit message: "fix 26.3 adapter"
 > git rev-list --no-walk 5aafffc2c7fd14312a129116ec5fa486e06b5bbd # timeout=10
[CubesideNMSUtils] $ /bin/bash -xe /home/tomcat/tomcatjenkins/temp/jenkins5354145313812020699.sh
+ chmod +x gradlew
[Gradle] - Launching build.
[CubesideNMSUtils] $ /home/tomcat/.jenkins/workspace/CubesideNMSUtils/gradlew build publishToMavenLocal publish
Starting a Gradle Daemon (subsequent builds will be faster)
Adapter Patterns: []
Including Adapter: v1_20_R2
Including Adapter: paper1_21_4
Including Adapter: paper26_3
Including Adapter: v1_17_R1
Including Adapter: paper1_20_4
Including Adapter: paper1_21
Including Adapter: v1_19_R2
Including Adapter: paper1_21_8
Including Adapter: paper1_21_6
Including Adapter: paper1_21_7
Including Adapter: v1_19_R3
Including Adapter: v1_18_R1
Including Adapter: paper26_2
Including Adapter: paper1_21_3
Including Adapter: paper1_20_6
Including Adapter: v1_19_R1
Including Adapter: v1_18_R2
Including Adapter: v1_20_R3
Including Adapter: paper1_21_5
Including Adapter: paper1_21_11
Including Adapter: v1_20_R1
Including Adapter: paper1_21_9
Including Adapter: paper26_1_2
Including Adapter: paper1_21_10

[Incubating] Problems report is available at: file:///home/tomcat/.jenkins/workspace/CubesideNMSUtils/build/reports/problems/problems-report.html

FAILURE: Build failed with an exception.

* What went wrong:
A problem occurred configuring root project 'CubesideNMSUtils'.
> Could not resolve all artifacts for configuration 'classpath'.
   > Could not resolve io.papermc.paperweight:paperweight-userdev:2.0.0-SNAPSHOT.
     Required by:
         buildscript of root project 'CubesideNMSUtils' > io.papermc.paperweight.userdev:io.papermc.paperweight.userdev.gradle.plugin:2.0.0-SNAPSHOT:20260928.193543-230
      > No matching variant of io.papermc.paperweight:paperweight-userdev:2.0.0-SNAPSHOT:20260928.193543-221 was found. The consumer was configured to find a library for use during runtime, compatible with Java 25, packaged as a jar, and its dependencies declared externally, as well as attribute 'org.gradle.plugin.api-version' with value '9.1.0' but:
          - Variant 'javadocElements' declares a component for use during runtime, and its dependencies declared externally:
              - Incompatible because this component declares documentation and the consumer needed a library
              - Other compatible attributes:
                  - Doesn't say anything about its elements (required them packaged as a jar)
                  - Doesn't say anything about its target Java version (required compatibility with Java 25)
                  - Doesn't say anything about org.gradle.plugin.api-version (required '9.1.0')
          - Variant 'shadowRuntimeElements' declares a library for use during runtime, compatible with Java 21, packaged as a jar, and its dependencies repackaged (shadow jar):
              - Incompatible because this component declares a component, as well as attribute 'org.gradle.plugin.api-version' with value '9.7.1' and the consumer needed a component, as well as attribute 'org.gradle.plugin.api-version' with value '9.1.0'
          - Variant 'sourcesElements' declares a component for use during runtime, and its dependencies declared externally:
              - Incompatible because this component declares documentation and the consumer needed a library
              - Other compatible attributes:
                  - Doesn't say anything about its elements (required them packaged as a jar)
                  - Doesn't say anything about its target Java version (required compatibility with Java 25)
                  - Doesn't say anything about org.gradle.plugin.api-version (required '9.1.0')

* Try:
> No matching variant errors are explained in more detail at https://docs.gradle.org/9.1.0/userguide/variant_model.html#sub:variant-no-match.
> Review the variant matching algorithm at https://docs.gradle.org/9.1.0/userguide/variant_attributes.html#sec:abm_algorithm.
> Run with --stacktrace option to get the stack trace.
> Run with --info or --debug option to get more log output.
> Run with --scan to generate a Build Scan (Powered by Develocity).
> Get more help at https://help.gradle.org.

BUILD FAILED in 5s
Build step 'Invoke Gradle script' changed build result to FAILURE
Build step 'Invoke Gradle script' marked build as failure
Skipped archiving because build is not successful
Finished: FAILURE