Skip to content
Started by user Brokkonaut
Running as SYSTEM
Building in workspace /home/tomcat/.jenkins/workspace/VoxelConfig
The recommended git tool is: NONE
No credentials specified
 > git rev-parse --resolve-git-dir /home/tomcat/.jenkins/workspace/VoxelConfig/.git # timeout=10
Fetching changes from the remote Git repository
 > git config remote.origin.url https://github.com/Updated-VoxelMap/VoxelConfig.git # timeout=10
Fetching upstream changes from https://github.com/Updated-VoxelMap/VoxelConfig.git
 > git --version # timeout=10
 > git --version # 'git version 2.47.3'
 > git fetch --tags --force --progress -- https://github.com/Updated-VoxelMap/VoxelConfig.git +refs/heads/*:refs/remotes/origin/* # timeout=10
 > git rev-parse refs/remotes/origin/master^{commit} # timeout=10
Checking out Revision 0d9971faa662b4baa2956888b420382472eb8b00 (refs/remotes/origin/master)
 > git config core.sparsecheckout # timeout=10
 > git checkout -f 0d9971faa662b4baa2956888b420382472eb8b00 # timeout=10
Commit message: "maybe"
 > git rev-list --no-walk ec922f4450f7f03146473972ad711b2492892f47 # timeout=10
[Gradle] - Launching build.
[VoxelConfig] $ /home/tomcat/.jenkins/workspace/VoxelConfig/gradlew build publish
Starting a Gradle Daemon (subsequent builds will be faster)

> Configure project :
Fabric Loom: 1.17.21
e: file:///home/tomcat/.jenkins/workspace/VoxelConfig/build.gradle.kts:14:5: Unresolved reference 'withsourcesjar'.
e: file:///home/tomcat/.jenkins/workspace/VoxelConfig/build.gradle.kts:15:5: Unresolved reference 'withjavadocjar'.

FAILURE: Build failed with an exception.

* Where:
Build file '/home/tomcat/.jenkins/workspace/VoxelConfig/build.gradle.kts' line: 14

* What went wrong:
Script compilation errors:

  Line 14:     withsourcesjar()
               ^ Unresolved reference 'withsourcesjar'.

  Line 15:     withjavadocjar()
               ^ Unresolved reference 'withjavadocjar'.

2 errors

* Try:
> Run with --stacktrace option to get the stack trace.
> Run with --info or --debug option to get more log output.
> Run with --scan to get full insights from a Build Scan (powered by Develocity).
> Get more help at https://help.gradle.org.

BUILD FAILED in 6s
Build step 'Invoke Gradle script' changed build result to FAILURE
Build step 'Invoke Gradle script' marked build as failure
Finished: FAILURE