Skip to content
Started by user Brokkonaut
Running as SYSTEM
Building in workspace /home/tomcat/.jenkins/workspace/CubesideNMSUtils
The recommended git tool is: NONE
using credential a740e5fc-56b2-4305-b679-a29aeacfeabf
 > git rev-parse --resolve-git-dir /home/tomcat/.jenkins/workspace/CubesideNMSUtils/.git # timeout=10
Fetching changes from the remote Git repository
 > git config remote.origin.url https://github.com/Cubeside/CubesideNMSUtils.git # timeout=10
Fetching upstream changes from https://github.com/Cubeside/CubesideNMSUtils.git
 > git --version # timeout=10
 > git --version # 'git version 2.47.3'
using GIT_ASKPASS to set credentials 
 > git fetch --tags --force --progress -- https://github.com/Cubeside/CubesideNMSUtils.git +refs/heads/*:refs/remotes/origin/* # timeout=10
 > git rev-parse refs/remotes/origin/master^{commit} # timeout=10
Checking out Revision 9aab1bc4634bb0612a37ba33f7fa2b398b23d513 (refs/remotes/origin/master)
 > git config core.sparsecheckout # timeout=10
 > git checkout -f 9aab1bc4634bb0612a37ba33f7fa2b398b23d513 # timeout=10
Commit message: "update wrapper"
 > git rev-list --no-walk 9aab1bc4634bb0612a37ba33f7fa2b398b23d513 # timeout=10
[CubesideNMSUtils] $ /bin/bash -xe /home/tomcat/tomcatjenkins/temp/jenkins918029431507344778.sh
+ chmod +x gradlew
[Gradle] - Launching build.
[CubesideNMSUtils] $ /home/tomcat/.jenkins/workspace/CubesideNMSUtils/gradlew build publishToMavenLocal publish
Starting a Gradle Daemon (subsequent builds will be faster)
Adapter Patterns: []
Including Adapter: v1_20_R2
Including Adapter: paper1_21_4
Including Adapter: paper26_3
Including Adapter: v1_17_R1
Including Adapter: paper1_20_4
Including Adapter: paper1_21
Including Adapter: v1_19_R2
Including Adapter: paper1_21_8
Including Adapter: paper1_21_6
Including Adapter: paper1_21_7
Including Adapter: v1_19_R3
Including Adapter: v1_18_R1
Including Adapter: paper26_2
Including Adapter: paper1_21_3
Including Adapter: paper1_20_6
Including Adapter: v1_19_R1
Including Adapter: v1_18_R2
Including Adapter: v1_20_R3
Including Adapter: paper1_21_5
Including Adapter: paper1_21_11
Including Adapter: v1_20_R1
Including Adapter: paper1_21_9
Including Adapter: paper26_1_2
Including Adapter: paper1_21_10
> Task :core:compileJava UP-TO-DATE
> Task :core:processResources NO-SOURCE
> Task :core:classes UP-TO-DATE
> Task :core:jar UP-TO-DATE
> Task :core:assemble UP-TO-DATE
> Task :core:compileTestJava NO-SOURCE
> Task :core:processTestResources NO-SOURCE
> Task :core:testClasses UP-TO-DATE
> Task :core:test NO-SOURCE
> Task :core:check UP-TO-DATE
> Task :core:build UP-TO-DATE
> Task :adapter:paper1_20_4:paperweightUserdevSetup UP-TO-DATE
> Task :adapter:paper1_20_4:compileJava UP-TO-DATE
> Task :adapter:paper1_20_4:processResources NO-SOURCE
> Task :adapter:paper1_20_4:classes UP-TO-DATE
> Task :adapter:paper1_20_4:jar UP-TO-DATE
> Task :adapter:paper1_20_4:reobfJar UP-TO-DATE
> Task :adapter:paper1_20_6:paperweightUserdevSetup UP-TO-DATE
> Task :adapter:paper1_20_6:compileJava UP-TO-DATE
> Task :adapter:paper1_20_6:processResources NO-SOURCE
> Task :adapter:paper1_20_6:classes UP-TO-DATE
> Task :adapter:paper1_20_6:jar UP-TO-DATE
> Task :adapter:paper1_20_6:reobfJar UP-TO-DATE
> Task :adapter:paper1_21:paperweightUserdevSetup UP-TO-DATE
> Task :adapter:paper1_21:compileJava UP-TO-DATE
> Task :adapter:paper1_21:processResources NO-SOURCE
> Task :adapter:paper1_21:classes UP-TO-DATE
> Task :adapter:paper1_21:jar UP-TO-DATE
> Task :adapter:paper1_21:reobfJar UP-TO-DATE
> Task :adapter:paper1_21_10:paperweightUserdevSetup UP-TO-DATE
> Task :adapter:paper1_21_10:compileJava UP-TO-DATE
> Task :adapter:paper1_21_10:processResources NO-SOURCE
> Task :adapter:paper1_21_10:classes UP-TO-DATE
> Task :adapter:paper1_21_10:jar UP-TO-DATE
> Task :adapter:paper1_21_10:reobfJar UP-TO-DATE
> Task :adapter:paper1_21_11:paperweightUserdevSetup UP-TO-DATE
> Task :adapter:paper1_21_11:compileJava UP-TO-DATE
> Task :adapter:paper1_21_11:processResources NO-SOURCE
> Task :adapter:paper1_21_11:classes UP-TO-DATE
> Task :adapter:paper1_21_11:jar UP-TO-DATE
> Task :adapter:paper1_21_11:reobfJar UP-TO-DATE
> Task :adapter:paper1_21_3:paperweightUserdevSetup UP-TO-DATE
> Task :adapter:paper1_21_3:compileJava UP-TO-DATE
> Task :adapter:paper1_21_3:processResources NO-SOURCE
> Task :adapter:paper1_21_3:classes UP-TO-DATE
> Task :adapter:paper1_21_3:jar UP-TO-DATE
> Task :adapter:paper1_21_3:reobfJar UP-TO-DATE
> Task :adapter:paper1_21_4:paperweightUserdevSetup UP-TO-DATE
> Task :adapter:paper1_21_4:compileJava UP-TO-DATE
> Task :adapter:paper1_21_4:processResources NO-SOURCE
> Task :adapter:paper1_21_4:classes UP-TO-DATE
> Task :adapter:paper1_21_4:jar UP-TO-DATE
> Task :adapter:paper1_21_4:reobfJar UP-TO-DATE
> Task :adapter:paper1_21_5:paperweightUserdevSetup UP-TO-DATE
> Task :adapter:paper1_21_5:compileJava UP-TO-DATE
> Task :adapter:paper1_21_5:processResources NO-SOURCE
> Task :adapter:paper1_21_5:classes UP-TO-DATE
> Task :adapter:paper1_21_5:jar UP-TO-DATE
> Task :adapter:paper1_21_5:reobfJar UP-TO-DATE
> Task :adapter:paper1_21_6:paperweightUserdevSetup UP-TO-DATE
> Task :adapter:paper1_21_6:compileJava UP-TO-DATE
> Task :adapter:paper1_21_6:processResources NO-SOURCE
> Task :adapter:paper1_21_6:classes UP-TO-DATE
> Task :adapter:paper1_21_6:jar UP-TO-DATE
> Task :adapter:paper1_21_6:reobfJar UP-TO-DATE
> Task :adapter:paper1_21_7:paperweightUserdevSetup UP-TO-DATE
> Task :adapter:paper1_21_7:compileJava UP-TO-DATE
> Task :adapter:paper1_21_7:processResources NO-SOURCE
> Task :adapter:paper1_21_7:classes UP-TO-DATE
> Task :adapter:paper1_21_7:jar UP-TO-DATE
> Task :adapter:paper1_21_7:reobfJar UP-TO-DATE
> Task :adapter:paper1_21_8:paperweightUserdevSetup UP-TO-DATE
> Task :adapter:paper1_21_8:compileJava UP-TO-DATE
> Task :adapter:paper1_21_8:processResources NO-SOURCE
> Task :adapter:paper1_21_8:classes UP-TO-DATE
> Task :adapter:paper1_21_8:jar UP-TO-DATE
> Task :adapter:paper1_21_8:reobfJar UP-TO-DATE
> Task :adapter:paper1_21_9:paperweightUserdevSetup UP-TO-DATE
> Task :adapter:paper1_21_9:compileJava UP-TO-DATE
> Task :adapter:paper1_21_9:processResources NO-SOURCE
> Task :adapter:paper1_21_9:classes UP-TO-DATE
> Task :adapter:paper1_21_9:jar UP-TO-DATE
> Task :adapter:paper1_21_9:reobfJar UP-TO-DATE
> Task :adapter:paper26_1_2:paperweightUserdevSetup UP-TO-DATE
> Task :adapter:paper26_1_2:compileJava UP-TO-DATE
> Task :adapter:paper26_1_2:processResources NO-SOURCE
> Task :adapter:paper26_1_2:classes UP-TO-DATE
> Task :adapter:paper26_1_2:jar UP-TO-DATE
> Task :adapter:paper26_2:paperweightUserdevSetup UP-TO-DATE
> Task :adapter:paper26_2:compileJava UP-TO-DATE
> Task :adapter:paper26_2:processResources NO-SOURCE
> Task :adapter:paper26_2:classes UP-TO-DATE
> Task :adapter:paper26_2:jar UP-TO-DATE
> Task :adapter:paper26_3:paperweightUserdevSetup UP-TO-DATE
> Task :adapter:paper26_3:compileJava UP-TO-DATE
> Task :adapter:paper26_3:processResources NO-SOURCE
> Task :adapter:paper26_3:classes UP-TO-DATE
> Task :adapter:paper26_3:jar UP-TO-DATE

> Task :adapter:v1_17_R1:paperweightUserdevSetup FAILED
Skipping applyPaperclipPatch (up-to-date)
Skipping vanillaServerDownloads (up-to-date)
Skipping filterVanillaJar (up-to-date)
Skipping downloadMinecraftLibraries (up-to-date)
Executing generateMappings...

[Incubating] Problems report is available at: file:///home/tomcat/.jenkins/workspace/CubesideNMSUtils/build/reports/problems/problems-report.html

FAILURE: Build failed with an exception.

* What went wrong:
Execution failed for task ':adapter:v1_17_R1:paperweightUserdevSetup' (registered by plugin 'io.papermc.paperweight.userdev').
> There was a failure while executing work items
   > A failure occurred while executing io.papermc.paperweight.tasks.GenerateMappingsAction
      > io/papermc/paperweight/tasks/GenerateMappingsParams has been compiled by a more recent version of the Java Runtime (class file version 65.0), this version of the Java Runtime only recognizes class file versions up to 61.0

* Try:
> Run with --stacktrace option to get the stack trace.
> Run with --info or --debug option to get more log output.
> Run with --scan to get full insights from a Build Scan (powered by Develocity).
> Get more help at https://help.gradle.org.

Deprecated Gradle features were used in this build, making it incompatible with Gradle 10.

You can use '--warning-mode all' to show the individual deprecation warnings and determine if they come from your own scripts or plugins.

For more on this, please refer to https://docs.gradle.org/9.8.0/userguide/command_line_interface.html#sec:command_line_warnings in the Gradle documentation.

BUILD FAILED in 8s
60 actionable tasks: 1 executed, 59 up-to-date
Build step 'Invoke Gradle script' changed build result to FAILURE
Build step 'Invoke Gradle script' marked build as failure
Skipped archiving because build is not successful
Finished: FAILURE