Started by user Brokkonaut
Running as SYSTEM
Building in workspace /home/tomcat/.jenkins/workspace/VoxelConfig
The recommended git tool is: NONE
No credentials specified
> git rev-parse --resolve-git-dir /home/tomcat/.jenkins/workspace/VoxelConfig/.git # timeout=10
Fetching changes from the remote Git repository
> git config remote.origin.url https://github.com/Updated-VoxelMap/VoxelConfig.git # timeout=10
Fetching upstream changes from https://github.com/Updated-VoxelMap/VoxelConfig.git
> git --version # timeout=10
> git --version # 'git version 2.47.3'
> git fetch --tags --force --progress -- https://github.com/Updated-VoxelMap/VoxelConfig.git +refs/heads/*:refs/remotes/origin/* # timeout=10
> git rev-parse refs/remotes/origin/master^{commit} # timeout=10
Checking out Revision 13079a156fa122be139a6b538c683157e6030a7f (refs/remotes/origin/master)
> git config core.sparsecheckout # timeout=10
> git checkout -f 13079a156fa122be139a6b538c683157e6030a7f # timeout=10
Commit message: "wtf"
> git rev-list --no-walk 0d9971faa662b4baa2956888b420382472eb8b00 # timeout=10
[Gradle] - Launching build.
[VoxelConfig] $ /home/tomcat/.jenkins/workspace/VoxelConfig/gradlew build publish
Starting a Gradle Daemon (subsequent builds will be faster)
> Configure project :
Fabric Loom: 1.17.21
> Task :compileJava UP-TO-DATE
> Task :processResources NO-SOURCE
> Task :classes UP-TO-DATE
> Task :processIncludeJars UP-TO-DATE
> Task :jar UP-TO-DATE
> Task :javadoc UP-TO-DATE
> Task :javadocJar UP-TO-DATE
> Task :sourcesJar UP-TO-DATE
> Task :assemble UP-TO-DATE
> Task :compileTestJava NO-SOURCE
> Task :processTestResources NO-SOURCE
> Task :testClasses UP-TO-DATE
> Task :test NO-SOURCE
> Task :validateAccessWidener NO-SOURCE
> Task :check UP-TO-DATE
> Task :build UP-TO-DATE
> Task :generateMetadataFileForMavenJavaPublication
> Task :generatePomFileForMavenJavaPublication
> Task :publishMavenJavaPublicationToIaniRepository FAILED
[Incubating] Problems report is available at: file:///home/tomcat/.jenkins/workspace/VoxelConfig/build/reports/problems/problems-report.html
FAILURE: Build failed with an exception.
* What went wrong:
A problem was found with the configuration of task ':publishMavenJavaPublicationToIaniRepository' (type 'PublishToMavenRepository').
Value not set
In plugin 'org.gradle.api.publish.maven.plugins.MavenPublishPlugin_Decorated' type 'org.gradle.api.publish.maven.tasks.PublishToMavenRepository' property 'credentials.username' doesn't have a configured value
This property isn't marked as optional and no value has been configured
For more information, please refer to https://docs.gradle.org/9.7.1/userguide/validation_problems.html#value_not_set in the Gradle documentation.
Possible solutions:
1. Assign a value to 'credentials.username'.
2. Mark property 'credentials.username' as optional.
* Try:
> Run with --scan to get full insights from a Build Scan (powered by Develocity).
BUILD FAILED in 8s
9 actionable tasks: 3 executed, 6 up-to-date
Build step 'Invoke Gradle script' changed build result to FAILURE
Build step 'Invoke Gradle script' marked build as failure
Finished: FAILURE